INNER CODE UNIT · Python
test_render_counts_list
apache/ozone · dev-support/ci/test_junit_summary.py:124
def test_render_counts_list(self):
md = junit_summary.render_summary(self.make_cases())
self.assertIn("## Test Summary", md)
self.assertIn("4 tests run in 6s (total test time):", md)
self.assertIn("- ✅ 1 PASSED\n- ❌ 1 FAILED\n- ⚠️ 1 FLAKY\n- 🙈 1 SKIPPED", md)
def test_render_counts_omit_zero(self):
cases = [c for c in self.make_cases() if c.status == "passed"]
md = junit_summary.render_summary(cases)
self.assertIn("- ✅ 1 PASSED", md)
self.assertNotIn("FAILED", md)
self.assertNotIn("FLAKY", md)
self.assertNotIn("SKIPPED", md)
def test_render_tables(self):
md = junit_summary.render_summary(self.make_cases())
self.assertIn("❌ FAILED (1)", md)
self.assertIn("|common|org.X.bad|boom|2s|", md)